BDBM50157241 5-[(2,6-Dichloro-benzyloxy)-(3-methyl-3H-imidazol-4-yl)-methyl]-2''-methyl-biphenyl-2-carbonitrile::CHEMBL182944
SMILES Cc1ccccc1-c1cc(ccc1C#N)C(OCc1c(Cl)cccc1Cl)c1cncn1C
InChI Key InChIKey=GYUGPLMRNBYLQG-UHFFFAOYSA-N
Data  1 IC50
  Tab Delimited (TSV)   2D SDfile   Computed 3D by Vconf -m prep SDfile
Find this compound or compounds like it in BindingDB:
Activity Spreadsheet -- Enzyme Inhibition Constant Data from BindingDB
Found 1 hit for monomerid = 50157241
LigandPNGBDBM50157241(5-[(2,6-Dichloro-benzyloxy)-(3-methyl-3H-imidazol-...)
Affinity DataIC50:  81nM. Assay description: Inhibition of Bovine farnesyl transeferase
In DepthDetails ArticlePubMed