BDBM50157244 2''-Methyl-5-[(3-methyl-3H-imidazol-4-yl)-(3-trifluoromethyl-benzyloxy)-methyl]-biphenyl-2-carbonitrile::2'-methyl-5-[(3-methyl-3H-imidazol-4-yl)-(3-trifluoromethyl-benzyloxy)-methyl]-biphenyl-2-carbonitrile::CHEMBL183290
SMILES Cc1ccccc1-c1cc(ccc1C#N)C(OCc1cccc(c1)C(F)(F)F)c1cncn1C
InChI Key InChIKey=MLJYSPZUWPQJRS-UHFFFAOYSA-N
Data  1 IC50
  Tab Delimited (TSV)   2D SDfile   Computed 3D by Vconf -m prep SDfile
Find this compound or compounds like it in BindingDB:
Activity Spreadsheet -- Enzyme Inhibition Constant Data from BindingDB
Found 1 hit for monomerid = 50157244
LigandPNGBDBM50157244(2''-Methyl-5-[(3-methyl-3H-imidazol-4-yl)-(3-trifl...)
Affinity DataIC50:  8.10nM. Assay description: Inhibition of Bovine farnesyl transeferase
In DepthDetails ArticlePubMed