BDBM50157248 5-[(4-Cyano-benzyloxy)-(3-methyl-3H-imidazol-4-yl)-methyl]-2''-methyl-biphenyl-2-carbonitrile::CHEMBL182978
SMILES Cc1ccccc1-c1cc(ccc1C#N)C(OCc1ccc(cc1)C#N)c1cncn1C
InChI Key InChIKey=LNNBTFQWNBDZFR-UHFFFAOYSA-N
Data  3 IC50  1 EC50
  Tab Delimited (TSV)   2D SDfile   Computed 3D by Vconf -m prep SDfile
Find this compound or compounds like it in BindingDB:
Activity Spreadsheet -- Enzyme Inhibition Constant Data from BindingDB
Found 4 hits for monomerid = 50157248
LigandPNGBDBM50157248(5-[(4-Cyano-benzyloxy)-(3-methyl-3H-imidazol-4-yl)...)
Affinity DataIC50:  4nM. Assay description: Inhibition of Bovine farnesyl transeferase
In DepthDetails ArticlePubMed
LigandPNGBDBM50157248(5-[(4-Cyano-benzyloxy)-(3-methyl-3H-imidazol-4-yl)...)
Affinity DataEC50:  420nM. Assay description: Effective concentration against H-ras processing in transformed NIH3T3 cells
In DepthDetails ArticlePubMed
LigandPNGBDBM50157248(5-[(4-Cyano-benzyloxy)-(3-methyl-3H-imidazol-4-yl)...)
Affinity DataIC50:  4nM. Assay description: Inhibition of Bovine farnesyl transeferase
In DepthDetails ArticlePubMed
LigandPNGBDBM50157248(5-[(4-Cyano-benzyloxy)-(3-methyl-3H-imidazol-4-yl)...)
Affinity DataIC50:  180nM. Assay description: Inhibition of Bovine Geranyl geranyl transeferase
In DepthDetails ArticlePubMed