BDBM50157264 5-[(3-Iodo-benzyloxy)-(3-methyl-3H-imidazol-4-yl)-methyl]-2''-methyl-biphenyl-2-carbonitrile::CHEMBL180536
SMILES Cc1ccccc1-c1cc(ccc1C#N)C(OCc1cccc(I)c1)c1cncn1C
InChI Key InChIKey=LFFSUIJNFZPRED-UHFFFAOYSA-N
Data  1 IC50
  Tab Delimited (TSV)   2D SDfile   Computed 3D by Vconf -m prep SDfile
Find this compound or compounds like it in BindingDB:
Activity Spreadsheet -- Enzyme Inhibition Constant Data from BindingDB
Found 1 hit for monomerid = 50157264
LigandPNGBDBM50157264(5-[(3-Iodo-benzyloxy)-(3-methyl-3H-imidazol-4-yl)-...)
Affinity DataIC50:  20nM. Assay description: Inhibition of Bovine farnesyl transeferase
In DepthDetails ArticlePubMed