BDBM50157292 5-[(2-Cyano-benzyloxy)-(3-methyl-3H-imidazol-4-yl)-methyl]-2''-methyl-biphenyl-2-carbonitrile::CHEMBL359540
SMILES Cc1ccccc1-c1cc(ccc1C#N)C(OCc1ccccc1C#N)c1cncn1C
InChI Key InChIKey=CFDRBHSLOFXPDE-UHFFFAOYSA-N
Data  1 IC50
  Tab Delimited (TSV)   2D SDfile   Computed 3D by Vconf -m prep SDfile
Find this compound or compounds like it in BindingDB:
Activity Spreadsheet -- Enzyme Inhibition Constant Data from BindingDB
Found 1 hit for monomerid = 50157292
LigandPNGBDBM50157292(5-[(2-Cyano-benzyloxy)-(3-methyl-3H-imidazol-4-yl)...)
Affinity DataIC50:  62nM. Assay description: Inhibition of Bovine farnesyl transeferase
In DepthDetails ArticlePubMed