BDBM50157295 2''-Methyl-5-[(3-methyl-benzyloxy)-(3-methyl-3H-imidazol-4-yl)-methyl]-biphenyl-2-carbonitrile::CHEMBL182347
SMILES Cc1cccc(COC(c2cncn2C)c2ccc(C#N)c(c2)-c2ccccc2C)c1
InChI Key InChIKey=BJIMRGCQMZVZHU-UHFFFAOYSA-N
Data  1 IC50
  Tab Delimited (TSV)   2D SDfile   Computed 3D by Vconf -m prep SDfile
Find this compound or compounds like it in BindingDB:
Activity Spreadsheet -- Enzyme Inhibition Constant Data from BindingDB
Found 1 hit for monomerid = 50157295
LigandPNGBDBM50157295(2''-Methyl-5-[(3-methyl-benzyloxy)-(3-methyl-3H-im...)
Affinity DataIC50:  61nM. Assay description: Inhibition of Bovine farnesyl transeferase
In DepthDetails ArticlePubMed