BDBM50157298 5-[(3-Bromo-benzyloxy)-(3-methyl-3H-imidazol-4-yl)-methyl]-2''-methyl-biphenyl-2-carbonitrile::CHEMBL361616
SMILES Cc1ccccc1-c1cc(ccc1C#N)C(OCc1cccc(Br)c1)c1cncn1C
InChI Key InChIKey=IBNOHTQTLVDELI-UHFFFAOYSA-N
Data  1 IC50
  Tab Delimited (TSV)   2D SDfile   Computed 3D by Vconf -m prep SDfile
Find this compound or compounds like it in BindingDB:
Activity Spreadsheet -- Enzyme Inhibition Constant Data from BindingDB
Found 1 hit for monomerid = 50157298
LigandPNGBDBM50157298(5-[(3-Bromo-benzyloxy)-(3-methyl-3H-imidazol-4-yl)...)
Affinity DataIC50:  13nM. Assay description: Inhibition of Bovine farnesyl transeferase
In DepthDetails ArticlePubMed