BDBM50157452 3-[4-(2,6-Dichloro-benzoylamino)-phenyl]-2-(3-{isobutyl-[(E)-(3-phenyl-acryloyl)]-amino}-phenyl)-propionic acid::CHEMBL361317
SMILES CC(C)CN(C(=O)\C=C\c1ccccc1)c1cccc(c1)C(Cc1ccc(NC(=O)c2c(Cl)cccc2Cl)cc1)C(O)=O
InChI Key InChIKey=LVIQWNBYDAOGAI-KNTRCKAVSA-N
Data  1 IC50
  Tab Delimited (TSV)   2D SDfile   Computed 3D by Vconf -m prep SDfile
Find this compound or compounds like it in BindingDB:
Activity Spreadsheet -- Enzyme Inhibition Constant Data from BindingDB
Found 1 hit for monomerid = 50157452
TargetIntegrin alpha-4/beta-1(Homo sapiens (Human))
Kaken Pharmaceutical
Curated by ChEMBL
LigandPNGBDBM50157452(3-[4-(2,6-Dichloro-benzoylamino)-phenyl]-2-(3-{iso...)
Affinity DataIC50:  5.30E+3nM. Assay description: Inhibition of Very late antigen-4 (VLA-4) expressing human leukemia cells (HL-60) aggregation with human Vascular cell adhesion molecule-1 (VCAM-1) e...
In DepthDetails ArticlePubMed