BDBM50159023 2-(4-Benzyl-piperazin-1-ylmethyl)-chroman-4-one::CHEMBL180180
SMILES O=C1CC(CN2CCN(Cc3ccccc3)CC2)Oc2ccccc12
InChI Key InChIKey=KPYUOWNNFWAQHD-UHFFFAOYSA-N
Data  3 KI
  Tab Delimited (TSV)   2D SDfile   Computed 3D by Vconf -m prep SDfile
Find this compound or compounds like it in BindingDB:
Activity Spreadsheet -- Enzyme Inhibition Constant Data from BindingDB
Found 3 hits for monomerid = 50159023
TargetSigma non-opioid intracellular receptor 1(Homo sapiens (Human))
Universit£
Curated by ChEMBL
LigandPNGBDBM50159023(2-(4-Benzyl-piperazin-1-ylmethyl)-chroman-4-one | ...)
Affinity DataKi:  1.20nM. Assay description: Inhibitory constant against sigma receptor type 1 using 3 nM [3H]pentazocine
In DepthDetails ArticlePubMed
TargetSigma non-opioid intracellular receptor 1(Homo sapiens (Human))
Universit£
Curated by ChEMBL
LigandPNGBDBM50159023(2-(4-Benzyl-piperazin-1-ylmethyl)-chroman-4-one | ...)
Affinity DataKi:  4.75nM. Assay description: Inhibitory constant against sigma receptor type 2 using 3 nM [3H]ditolylguanidine
In DepthDetails ArticlePubMed
Target5-hydroxytryptamine receptor 1A(Homo sapiens (Human))
Universit£
Curated by ChEMBL
LigandPNGBDBM50159023(2-(4-Benzyl-piperazin-1-ylmethyl)-chroman-4-one | ...)
Affinity DataKi: >1.00E+3nM. Assay description: Inhibitory constant was determined against 5-hydroxytryptamine 1A receptor using 1.2 nM [3H]8-OH-DPAT
In DepthDetails ArticlePubMed