BDBM50159438 CHEMBL387005::cyclo(7-12) Des-AA1,2,5-[Glu7,D-Trp8,(NMe)IAmp9,m-I-Tyr11,Lys12]SRIF
SMILES CC(C)NCc1ccc(C[C@@H]2N(C)C(=O)[C@H](Cc3c[nH]c4ccccc34)NC(=O)[C@H]3CCC(=O)NCCCC[C@H](NC(=O)[C@H](Cc4ccc(O)cc4I)NC(=O)[C@H](NC2=O)[C@@H](C)O)C(=O)N[C@@H](CO)C(=O)N[C@@H](CSSC[C@@H](N)C(=O)N[C@H](CCCCN)C(=O)N[C@H](Cc2ccccc2)C(=O)N3)C(N)=O)cc1
InChI Key InChIKey=BISKEDCOTSGVNU-FSWRRGMRSA-N
Data  5 IC50
  Tab Delimited (TSV)   2D SDfile   Computed 3D by Vconf -m prep SDfile
Find this compound or compounds like it in BindingDB:
Activity Spreadsheet -- Enzyme Inhibition Constant Data from BindingDB
Found 5 hits for monomerid = 50159438
TargetSomatostatin receptor type 3(Homo sapiens (Human))
Salk Institute
Curated by ChEMBL
LigandPNGBDBM50159438(CHEMBL387005 | cyclo(7-12) Des-AA1,2,5-[Glu7,D-Trp...)
Affinity DataIC50:  254nM. Assay description: Inhibition of 125I-[Leu8,D-Trp22,Tyr25]SRIF-28 binding to human somatostatin receptor type 3
In DepthDetails ArticlePubMed
TargetSomatostatin receptor type 5(Homo sapiens (Human))
Salk Institute
Curated by ChEMBL
LigandPNGBDBM50159438(CHEMBL387005 | cyclo(7-12) Des-AA1,2,5-[Glu7,D-Trp...)
Affinity DataIC50: >1.00E+3nM. Assay description: Inhibition of 125I-[Leu8,D-Trp22,Tyr25]SRIF-28 binding to human somatostatin receptor type 5
In DepthDetails ArticlePubMed
TargetSomatostatin receptor type 2(Homo sapiens (Human))
Salk Institute
Curated by ChEMBL
LigandPNGBDBM50159438(CHEMBL387005 | cyclo(7-12) Des-AA1,2,5-[Glu7,D-Trp...)
Affinity DataIC50: >1.00E+3nM. Assay description: Inhibition of 125I-[Leu8,D-Trp22,Tyr25]SRIF-28 binding to human somatostatin receptor type 2
In DepthDetails ArticlePubMed
TargetSomatostatin receptor type 1(Homo sapiens (Human))
Salk Institute
Curated by ChEMBL
LigandPNGBDBM50159438(CHEMBL387005 | cyclo(7-12) Des-AA1,2,5-[Glu7,D-Trp...)
Affinity DataIC50:  14nM. Assay description: Inhibition of 125I-[Leu8,D-Trp22,Tyr25]SRIF-28 binding to human somatostatin receptor type 1
In DepthDetails ArticlePubMed
TargetSomatostatin receptor type 4(Homo sapiens (Human))
Salk Institute
Curated by ChEMBL
LigandPNGBDBM50159438(CHEMBL387005 | cyclo(7-12) Des-AA1,2,5-[Glu7,D-Trp...)
Affinity DataIC50: >1.00E+3nM. Assay description: Inhibition of 125I-[Leu8,D-Trp22,Tyr25]SRIF-28 binding to human somatostatin receptor type 4
In DepthDetails ArticlePubMed