BDBM92494 Citrate::SODIUM CITRATE
SMILES OC(CC([O-])=O)(CC([O-])=O)C([O-])=O
InChI Key InChIKey=KRKNYBCHXYNGOX-UHFFFAOYSA-K
Data  7 KI  1 Kd  1 ITC
PDB links: 622 PDB IDs match this monomer.
  Tab Delimited (TSV)   2D SDfile   Computed 3D by Vconf -m prep SDfile
Find this compound or compounds like it in BindingDB:
Activity Spreadsheet -- Enzyme Inhibition Constant Data from BindingDB
Found 8 hits for monomerid = 92494
TargetCarbonic anhydrase 4(Homo sapiens (Human))
Università
Curated by ChEMBL
LigandPNGBDBM92494(Citrate | SODIUM CITRATE)
Affinity DataKi:  99nM. Assay description: Binding affinity against human cytosolic Carbonic anhydrase IV
In DepthDetails ArticlePubMed
TargetCarbonic anhydrase(Candida albicans (Yeast))
Università
Curated by ChEMBL
LigandPNGBDBM92494(Citrate | SODIUM CITRATE)
Affinity DataKi:  3.91E+4nM. Assay description: Inhibition of Candida albicans Nce103
In DepthDetails ArticlePubMed
TargetCarbonic anhydrase [110-330](Flaveria bidentis (Coastal plain yellowtops))
Istituto Di Biostrutture E Bioimmagini-Cnr
LigandPNGBDBM92494(Citrate | SODIUM CITRATE)
Affinity DataKi:  4.14E+4nM ΔG°:  -5.87kcal/molepH: 8.3 T: 2°C. Assay description: Inhibition constants of carboxylate inhibitors against F. bidentis CA I were determined by a stopped flow CO2 hydration assay at 20 °C.
In DepthDetails ArticlePubMed
TargetCarbonic anhydrase 5A, mitochondrial(Homo sapiens (Human))
Università
Curated by ChEMBL
LigandPNGBDBM92494(Citrate | SODIUM CITRATE)
Affinity DataKi:  1.67E+6nM. Assay description: Binding affinity against human cytosolic Carbonic anhydrase V
In DepthDetails ArticlePubMed
TargetCarbonic anhydrase 2(Homo sapiens (Human))
Università
Curated by ChEMBL
LigandPNGBDBM92494(Citrate | SODIUM CITRATE)
Affinity DataKi:  2.16E+6nM. Assay description: Binding affinity against human cytosolic Carbonic anhydrase II
TargetCarbonic anhydrase 2(Homo sapiens (Human))
Università
Curated by ChEMBL
LigandPNGBDBM92494(Citrate | SODIUM CITRATE)
Affinity DataKi:  2.16E+6nM. Assay description: Inhibition of human carbonic anhydrase2
TargetCarbonic anhydrase 9(Homo sapiens (Human))
Università
Curated by ChEMBL
LigandPNGBDBM92494(Citrate | SODIUM CITRATE)
Affinity DataKi:  4.93E+6nM. Assay description: Binding affinity against human cytosolic Carbonic anhydrase IX
In DepthDetails ArticlePubMed
TargetMethyl-accepting chemotaxis protein NahY(Pseudomonas putida (Arthrobacter siderocapsulatus))
Csic
LigandPNGBDBM92494(Citrate | SODIUM CITRATE)
Affinity DataKd:  1.09E+5nMT: 2°C. Assay description: Measurements were done on a VP-microcalorimeter (MicroCal, Amherst, MA).
In DepthDetails ArticlePubMed
Activity Spreadsheet -- ITC Data from BindingDB
Found 1 hit for monomerid = 92494
CellMethyl-accepting chemotaxis protein (McpS)(Pseudomonas putida (Arthrobacter siderocapsulatus))
Csic
SyringePNGBDBM92494(Citrate | SODIUM CITRATE)
ITC DataΔG°: -5.31kcal/mole −TΔS°: 4.20kcal/mole ΔH°: -9.31kcal/mole logk: 9.17E+3
T: 20.00°C
In DepthDetails ArticlePubMed