BDBM50160725 Biphenyl-4-carboxylic acid methyl-{3-[methyl-(1-methyl-pyrrolidin-3-yl)-carbamoyl]-propyl}-amide::CHEMBL178515
SMILES CN(CCCC(=O)N(C)C1CCN(C)C1)C(=O)c1ccc(cc1)-c1ccccc1
InChI Key InChIKey=QGNCKEQFETVNHZ-UHFFFAOYSA-N
Data  1 KI
  Tab Delimited (TSV)   2D SDfile   Computed 3D by Vconf -m prep SDfile
Find this compound or compounds like it in BindingDB:
Activity Spreadsheet -- Enzyme Inhibition Constant Data from BindingDB
Found 1 hit for monomerid = 50160725
TargetMelanin-concentrating hormone receptor 1(Homo sapiens (Human))
Neurocrine Biosciences
Curated by ChEMBL
LigandPNGBDBM50160725(Biphenyl-4-carboxylic acid methyl-{3-[methyl-(1-me...)
Affinity DataKi:  142nM. Assay description: Displacement of [125I]MCH from human Melanin-concentrating hormone 1 (MCH1) receptor modified for optimal expression in HEK293 cells
In DepthDetails ArticlePubMed