BDBM50162407 CHEMBL195657::[2-(4-tert-Butyl-phenyl)-2-(4-phenyl-piperazin-1-yl)-ethyl]-[2-(2-methoxy-phenyl)-ethyl]-amine
SMILES COc1ccccc1CCNCC(N1CCN(CC1)c1ccccc1)c1ccc(cc1)C(C)(C)C
InChI Key InChIKey=BIKFSSUQPVPOTQ-UHFFFAOYSA-N
Data  1 KI
  Tab Delimited (TSV)   2D SDfile   Computed 3D by Vconf -m prep SDfile
Find this compound or compounds like it in BindingDB:
Activity Spreadsheet -- Enzyme Inhibition Constant Data from BindingDB
Found 1 hit for monomerid = 50162407
TargetC-C chemokine receptor type 3(Homo sapiens (Human))
Biographics Laboratory 3R
Curated by ChEMBL
LigandPNGBDBM50162407(CHEMBL195657 | [2-(4-tert-Butyl-phenyl)-2-(4-pheny...)
Affinity DataKi:  488nM. Assay description: Inhibition of [125I]-eotaxin-1 binding to human chemokine receptor (hCCR3-C1)
In DepthDetails ArticlePubMed