BDBM50162413 CHEMBL427357::[2-(4-Methoxy-phenyl)-ethyl]-[2-(4-phenyl-piperazin-1-yl)-2-(4-trifluoromethyl-phenyl)-ethyl]-amine
SMILES COc1ccc(CCNCC(N2CCN(CC2)c2ccccc2)c2ccc(cc2)C(F)(F)F)cc1
InChI Key InChIKey=NKQKBALSOAMMEY-UHFFFAOYSA-N
Data  1 KI
  Tab Delimited (TSV)   2D SDfile   Computed 3D by Vconf -m prep SDfile
Find this compound or compounds like it in BindingDB:
Activity Spreadsheet -- Enzyme Inhibition Constant Data from BindingDB
Found 1 hit for monomerid = 50162413
TargetC-C chemokine receptor type 3(Homo sapiens (Human))
Biographics Laboratory 3R
Curated by ChEMBL
LigandPNGBDBM50162413(CHEMBL427357 | [2-(4-Methoxy-phenyl)-ethyl]-[2-(4-...)
Affinity DataKi:  393nM. Assay description: Inhibition of [125I]-eotaxin-1 binding to human chemokine receptor (hCCR3-C1)
In DepthDetails ArticlePubMed