BDBM50163927 CHEMBL425528::[(3-Iodo-benzoyl)-(4-trifluoromethyl-benzyl)-amino]-phenyl-acetic acid
SMILES OC(=O)C(N(Cc1ccc(cc1)C(F)(F)F)C(=O)c1cccc(I)c1)c1ccccc1
InChI Key InChIKey=QHTQZPBBQSXYLJ-UHFFFAOYSA-N
Data  1 IC50
  Tab Delimited (TSV)   2D SDfile   Computed 3D by Vconf -m prep SDfile
Find this compound or compounds like it in BindingDB:
Activity Spreadsheet -- Enzyme Inhibition Constant Data from BindingDB
Found 1 hit for monomerid = 50163927
TargetE3 ubiquitin-protein ligase Mdm2(Homo sapiens (Human))
Johnson & Johnson Pharmaceutical Research And Development
Curated by ChEMBL
LigandPNGBDBM50163927(CHEMBL425528 | [(3-Iodo-benzoyl)-(4-trifluoromethy...)
Affinity DataIC50:  1.50E+4nM. Assay description: Binding affinity between MDM2 and p53 protein in fluorescence peptide assay
In DepthDetails ArticlePubMed