BDBM50164873 CHEMBL195659::[3-(2-Chloro-phenyl)-5-(3-hydroxy-phenyl)-4,5-dihydro-pyrazol-1-yl]-phenyl-methanone
SMILES Oc1cccc(c1)C1CC(=NN1C(=O)c1ccccc1)c1ccccc1Cl
InChI Key InChIKey=VDDQGBFZTOSUKE-UHFFFAOYSA-N
Data  1 IC50
  Tab Delimited (TSV)   2D SDfile   Computed 3D by Vconf -m prep SDfile
Find this compound or compounds like it in BindingDB:
Activity Spreadsheet -- Enzyme Inhibition Constant Data from BindingDB
Found 1 hit for monomerid = 50164873
TargetKinesin-like protein KIF11(Homo sapiens (Human))
Merck Research Laboratories
Curated by ChEMBL
LigandPNGBDBM50164873(CHEMBL195659 | [3-(2-Chloro-phenyl)-5-(3-hydroxy-p...)
Affinity DataIC50:  1.35E+4nM. Assay description: In vitro inhibitory concentration towards kinesin spindle protein activity of ATP hydrolysis in the presence of microtubules measured by ATPase assay...
In DepthDetails ArticlePubMed