BDBM50166223 CHEMBL265137::Vasopressin Analogue
SMILES COc1ccc(C[C@@H](NC(=O)c2ccc(cc2)C(=O)c2ccccc2)C(=O)N[C@@H](Cc2ccccc2)C(=O)N[C@@H](CCC(N)=O)C(=O)N[C@@H](CC(N)=O)C(=O)N[C@@H](CCCNC(N)=N)C(=O)N2CCC[C@@H]2C(=O)N[C@@H](CCCNC(N)=N)C(=O)N[C@@H](Cc2ccc(O)c(I)c2)C(N)=O)cc1
InChI Key InChIKey=JISZVQDLLQSZFN-FETOTSAZSA-N
Data  1 KI
  Tab Delimited (TSV)   2D SDfile   Computed 3D by Vconf -m prep SDfile
Find this compound or compounds like it in BindingDB:
Activity Spreadsheet -- Enzyme Inhibition Constant Data from BindingDB
Found 1 hit for monomerid = 50166223
TargetVasopressin V1a receptor(Homo sapiens (Human))
University Of Montpellier
Curated by ChEMBL
LigandPNGBDBM50166223(CHEMBL265137 | Vasopressin Analogue)
Affinity DataKi:  18nM. Assay description: Binding affinity against human vasopressin V1a receptor expressed in CHO cells
In DepthDetails ArticlePubMed