BDBM50168314 CHEMBL193015::[(7S,14R,18S)-18-Carbamoylmethyl-10-(4-carboxymethyl-phenyl)-14-(5-methyl-indol-1-ylmethyl)-17,20-dioxo-8-(S)-oxo-7,16,19-triaza-spiro[5.14]icos-11-en-9-yl]-acetic acid
SMILES Cc1ccc2n(C[C@H]3CNC(=O)[C@H](CC(N)=O)NC(=O)C4(CCCCC4)NC(=O)[C@@H](CC(O)=O)[C@H](\C=C\C3)c3ccc(CC(O)=O)cc3)ccc2c1
InChI Key InChIKey=WDSHANHIKDRCCI-AZSCFGFUSA-N
Data  1 IC50  1 Kd
  Tab Delimited (TSV)   2D SDfile   Computed 3D by Vconf -m prep SDfile
Find this compound or compounds like it in BindingDB:
Activity Spreadsheet -- Enzyme Inhibition Constant Data from BindingDB
Found 2 hits for monomerid = 50168314
TargetGrowth factor receptor-bound protein 2(Homo sapiens (Human))
National Cancer Institute-Frederick
Curated by ChEMBL
LigandPNGBDBM50168314(CHEMBL193015 | [(7S,14R,18S)-18-Carbamoylmethyl-10...)
Affinity DataIC50:  22.5nM. Assay description: Inhibitory concentration against growth factor receptor bound protein 2
In DepthDetails ArticlePubMed
TargetGrowth factor receptor-bound protein 2(Homo sapiens (Human))
National Cancer Institute-Frederick
Curated by ChEMBL
LigandPNGBDBM50168314(CHEMBL193015 | [(7S,14R,18S)-18-Carbamoylmethyl-10...)
Affinity DataKd:  33nM. Assay description: Dissociation constant value against growth factor receptor bound protein 2
In DepthDetails ArticlePubMed