BDBM50168362 6-(4-Hydroxy-phenyl)-1-phenyl-naphthalen-2-ol::CHEMBL192102
SMILES Oc1ccc(cc1)-c1ccc2c(c(O)ccc2c1)-c1ccccc1
InChI Key InChIKey=INNGVLJQICTRAF-UHFFFAOYSA-N
Data  2 IC50
  Tab Delimited (TSV)   2D SDfile   Computed 3D by Vconf -m prep SDfile
Find this compound or compounds like it in BindingDB:
Activity Spreadsheet -- Enzyme Inhibition Constant Data from BindingDB
Found 2 hits for monomerid = 50168362
TargetEstrogen receptor beta(Homo sapiens (Human))
Wyeth Research
Curated by ChEMBL
LigandPNGBDBM50168362(6-(4-Hydroxy-phenyl)-1-phenyl-naphthalen-2-ol | CH...)
Affinity DataIC50:  748nM. Assay description: Inhibition of [3H]-17-beta-estradiol binding to human estrogen receptor beta expressed in Escherichia coli
In DepthDetails ArticlePubMed
TargetEstrogen receptor(Homo sapiens (Human))
Wyeth Research
Curated by ChEMBL
LigandPNGBDBM50168362(6-(4-Hydroxy-phenyl)-1-phenyl-naphthalen-2-ol | CH...)
Affinity DataIC50:  1.23E+3nM. Assay description: Inhibition of [3H]-17-beta-estradiol binding to human estrogen receptor alpha expressed in Escherichia coli
In DepthDetails ArticlePubMed