BDBM50168441 ({[(1Z)-2,2-dimethyl-1-oxidohydrazono]amino}oxy)methyl (1-para-chlorobenzoyl-2-methyl-5-methoxy-1H-indol-3-yl)acetate::CHEMBL448156
SMILES COc1ccc2n(C(=O)c3ccc(Cl)cc3)c(C)c(CC(=O)OCO\N=[N+](/[O-])N(C)C)c2c1
InChI Key InChIKey=LRFOMIMOOPCTBY-PNHLSOANSA-N
Data  2 IC50
  Tab Delimited (TSV)   2D SDfile   Computed 3D by Vconf -m prep SDfile
Find this compound or compounds like it in BindingDB:
Activity Spreadsheet -- Enzyme Inhibition Constant Data from BindingDB
Found 2 hits for monomerid = 50168441
TargetProstaglandin G/H synthase 2(Ovis aries (Sheep))
University Of Alberta
Curated by ChEMBL
LigandPNGBDBM50168441(({[(1Z)-2,2-dimethyl-1-oxidohydrazono]amino}oxy)me...)
Affinity DataIC50: >1.00E+5nM. Assay description: In vitro inhibitory concentration of the compound against COX-2 enzyme
In DepthDetails ArticlePubMed
TargetProstaglandin G/H synthase 1(Ovis aries (Sheep))
University Of Alberta
Curated by ChEMBL
LigandPNGBDBM50168441(({[(1Z)-2,2-dimethyl-1-oxidohydrazono]amino}oxy)me...)
Affinity DataIC50: >1.00E+5nM. Assay description: In vitro inhibitory concentration of the compound against COX-1 enzyme
In DepthDetails ArticlePubMed