BDBM50169244 (4-Benzoyl-2,6-dipropyl-phenoxy)-phenyl-acetic acid::CHEMBL366207
SMILES CCCc1cc(cc(CCC)c1OC(C(O)=O)c1ccccc1)C(=O)c1ccccc1
InChI Key InChIKey=MKPLSEQCTOWGFL-UHFFFAOYSA-N
Data  2 IC50
  Tab Delimited (TSV)   2D SDfile   Computed 3D by Vconf -m prep SDfile
Find this compound or compounds like it in BindingDB:
Activity Spreadsheet -- Enzyme Inhibition Constant Data from BindingDB
Found 2 hits for monomerid = 50169244
TargetPeroxisome proliferator-activated receptor alpha(Homo sapiens (Human))
Merck Research Laboratories
Curated by ChEMBL
LigandPNGBDBM50169244((4-Benzoyl-2,6-dipropyl-phenoxy)-phenyl-acetic aci...)
Affinity DataIC50:  800nM. Assay description: In vitro binding affinity for human PPAR alpha
In DepthDetails ArticlePubMed
TargetPeroxisome proliferator-activated receptor gamma(Homo sapiens (Human))
Merck Research Laboratories
Curated by ChEMBL
LigandPNGBDBM50169244((4-Benzoyl-2,6-dipropyl-phenoxy)-phenyl-acetic aci...)
Affinity DataIC50:  4.68E+3nM. Assay description: In vitro binding affinity for human PPAR gamma
In DepthDetails ArticlePubMed