BDBM50169758 2-benzoyl-4-methylphenyl benzoate::Benzoic acid 2-benzoyl-4-methyl-phenyl ester::CHEMBL186940
SMILES Cc1ccc(OC(=O)c2ccccc2)c(c1)C(=O)c1ccccc1
InChI Key InChIKey=QYMMDDHJIJSMCJ-UHFFFAOYSA-N
Data  3 IC50
  Tab Delimited (TSV)   2D SDfile   Computed 3D by Vconf -m prep SDfile
Find this compound or compounds like it in BindingDB:
Activity Spreadsheet -- Enzyme Inhibition Constant Data from BindingDB
Found 3 hits for monomerid = 50169758
TargetBasic phospholipase A2 PLA-A(Trimeresurus flavoviridis)
University Of Mysore
Curated by ChEMBL
LigandPNGBDBM50169758(2-benzoyl-4-methylphenyl benzoate | Benzoic acid 2...)
Affinity DataIC50:  6.90E+4nM. Assay description: In vitro inhibitory concentration against phospholipase A2 of Trimeresurus flavoviridis venom
In DepthDetails ArticlePubMed
TargetBasic phospholipase A2 1(Naja melanoleuca)
University Of Mysore
Curated by ChEMBL
LigandPNGBDBM50169758(2-benzoyl-4-methylphenyl benzoate | Benzoic acid 2...)
Affinity DataIC50:  6.00E+4nM. Assay description: In vitro inhibitory concentration against phospholipase A2 of Naja melanoleuca venom
In DepthDetails ArticlePubMed
TargetAcidic phospholipase A2 EC-I(Echis carinatus)
University Of Mysore
Curated by ChEMBL
LigandPNGBDBM50169758(2-benzoyl-4-methylphenyl benzoate | Benzoic acid 2...)
Affinity DataIC50:  9.40E+4nM. Assay description: In vitro inhibitory concentration against phospholipase A2 of Echis carinatus venom
In DepthDetails ArticlePubMed