BDBM50170102 CHEMBL3805123
SMILES CN1CCN(CC1)c1ccc(C(=O)Nc2n[nH]c3ccc(Cc4cc(F)cc(F)c4)cc23)c(N[C@H]2CC[C@H](O)CC2)c1
InChI Key InChIKey=COPINYWCESNOFK-YOCNBXQISA-N
Data  3 IC50
PDB links: 1 PDB ID matches this monomer.
  Tab Delimited (TSV)   2D SDfile   Computed 3D by Vconf -m prep SDfile
Find this compound or compounds like it in BindingDB:
Activity Spreadsheet -- Enzyme Inhibition Constant Data from BindingDB
Found 3 hits for monomerid = 50170102
TargetInsulin-like growth factor 1 receptor(Homo sapiens (Human))
Nerviano Medical Sciences
Curated by ChEMBL
LigandPNGBDBM50170102(CHEMBL3805123)
Affinity DataIC50:  124nM. Assay description: Inhibition of IGF1R (unknown origin) in presence of gamma33-ATP
In DepthDetails ArticlePubMed
TargetALK tyrosine kinase receptor(Homo sapiens (Human))
Nerviano Medical Sciences
Curated by ChEMBL
LigandPNGBDBM50170102(CHEMBL3805123)
Affinity DataIC50:  10nM. Assay description: Inhibition of recombinant ALK (unknown origin) in presence of gamma33-ATP
TargetInsulin receptor(Homo sapiens (Human))
Nerviano Medical Sciences
Curated by ChEMBL
LigandPNGBDBM50170102(CHEMBL3805123)
Affinity DataIC50:  189nM. Assay description: Inhibition of IR (unknown origin) in presence of gamma33-ATP
In DepthDetails ArticlePubMed