BDBM50170708 (S)-1-((S)-1-Benzoyl-pyrrolidine-2-carbonyl)-pyrrolidine-2-carbonitrile::CHEMBL363655
SMILES O=C([C@@H]1CCCN1C(=O)c1ccccc1)N1CCC[C@H]1C#N
InChI Key InChIKey=OACPBABDSINWMY-GJZGRUSLSA-N
Data  1 IC50
  Tab Delimited (TSV)   2D SDfile   Computed 3D by Vconf -m prep SDfile
Find this compound or compounds like it in BindingDB:
Activity Spreadsheet -- Enzyme Inhibition Constant Data from BindingDB
Found 1 hit for monomerid = 50170708
TargetProlyl endopeptidase(Sus scrofa)
University Of Kuopio
Curated by ChEMBL
LigandPNGBDBM50170708((S)-1-((S)-1-Benzoyl-pyrrolidine-2-carbonyl)-pyrro...)
Affinity DataIC50:  3.10nMpH: 7.0Assay Description:In vitro inhibitory activity against porcine prolyl oligopeptidase by using 4 mM Suc-Gly-Pro-7-amido-4-methylcoumarin as substrate (pH 7.0) at 30 deg...
In DepthDetails ArticlePubMed