BDBM50172156 CHEMBL197825::N-(1-{4-[4-Chloro-2-(4-chloro-benzenesulfonyl)-benzoyl]-phenyl}-ethyl)-methanesulfonamide
SMILES CC(NS(C)(=O)=O)c1ccc(cc1)C(=O)c1ccc(Cl)cc1S(=O)(=O)c1ccc(Cl)cc1
InChI Key InChIKey=SBTZNBAAKOUXPV-UHFFFAOYSA-N
Data  1 KI
  Tab Delimited (TSV)   2D SDfile   Computed 3D by Vconf -m prep SDfile
Find this compound or compounds like it in BindingDB:
Activity Spreadsheet -- Enzyme Inhibition Constant Data from BindingDB
Found 1 hit for monomerid = 50172156
TargetCannabinoid receptor 2(Homo sapiens (Human))
Schering-Plough Research Institute
Curated by ChEMBL
LigandPNGBDBM50172156(CHEMBL197825 | N-(1-{4-[4-Chloro-2-(4-chloro-benze...)
Affinity DataKi:  410nM. Assay description: Inhibition constant against Cannabinoid receptor 2
In DepthDetails ArticlePubMed