BDBM50173025 4-[4-(4-Carbamoyl-phenyl)-phthalazin-1-ylamino]-benzoic acid methyl ester::CHEMBL196610::methyl 4-(4-(4-carbamoylphenyl)phthalazin-1-ylamino)benzoate
SMILES COC(=O)c1ccc(Nc2nnc(-c3ccc(cc3)C(N)=O)c3ccccc23)cc1
InChI Key InChIKey=BPTRMWHKPOMVMB-UHFFFAOYSA-N
Data  2 IC50
  Tab Delimited (TSV)   2D SDfile   Computed 3D by Vconf -m prep SDfile
Find this compound or compounds like it in BindingDB:
Activity Spreadsheet -- Enzyme Inhibition Constant Data from BindingDB
Found 2 hits for monomerid = 50173025
TargetVascular endothelial growth factor receptor 2(Homo sapiens (Human))
Imclone Systems
Curated by ChEMBL
LigandPNGBDBM50173025(4-[4-(4-Carbamoyl-phenyl)-phthalazin-1-ylamino]-be...)
Affinity DataIC50:  2.70E+3nM. Assay description: Inhibition of VEGFR2 (unknown origin) by HTRF method
In DepthDetails ArticlePubMed
TargetVascular endothelial growth factor receptor 2(Homo sapiens (Human))
Imclone Systems
Curated by ChEMBL
LigandPNGBDBM50173025(4-[4-(4-Carbamoyl-phenyl)-phthalazin-1-ylamino]-be...)
Affinity DataIC50:  2.70E+3nM. Assay description: Inhibition of Vascular endothelial growth factor receptor 2 kinase phosphorylation of pGAT-biotin peptide
In DepthDetails ArticlePubMed