BDBM50173272 CHEMBL370226::methyl 2-[2-oxo-1'-(1,2,3,4-tetrahydro-2-naphthalenyl)spiro[2,3-dihydro-1H-indole-3,4'-(hexahydropyridine)]-1-yl]acetate
SMILES COC(=O)CN1C(=O)C2(CCN(CC2)C2CCc3ccccc3C2)c2ccccc12
InChI Key InChIKey=IQDFFDXDACEMCZ-UHFFFAOYSA-N
Data  1 IC50
  Tab Delimited (TSV)   2D SDfile   Computed 3D by Vconf -m prep SDfile
Find this compound or compounds like it in BindingDB:
Activity Spreadsheet -- Enzyme Inhibition Constant Data from BindingDB
Found 1 hit for monomerid = 50173272
TargetNociceptin receptor(Homo sapiens (Human))
Johnson & Johnson Pharmaceutical Research And Development
Curated by ChEMBL
LigandPNGBDBM50173272(CHEMBL370226 | methyl 2-[2-oxo-1'-(1,2,3,4-tetrahy...)
Affinity DataIC50:  1.08E+3nM. Assay description: Binding affinity determined by the ability to compete with [125I]-Tyr14- nociceptin from binding to human opiate receptor-like 1 expressed in HEK293 ...
In DepthDetails ArticlePubMed