BDBM50173279 CHEMBL383561::methyl [1'-(cyclopropylmethyl)-2-oxospiro[indole-3,4'-piperidin]-1(2H)-yl]acetate
SMILES COC(=O)CN1C(=O)C2(CCN(CC3CC3)CC2)c2ccccc12
InChI Key InChIKey=FNAPUUOMTUXUGT-UHFFFAOYSA-N
Data  1 IC50
  Tab Delimited (TSV)   2D SDfile   Computed 3D by Vconf -m prep SDfile
Find this compound or compounds like it in BindingDB:
Activity Spreadsheet -- Enzyme Inhibition Constant Data from BindingDB
Found 1 hit for monomerid = 50173279
TargetNociceptin receptor(Homo sapiens (Human))
Johnson & Johnson Pharmaceutical Research And Development
Curated by ChEMBL
LigandPNGBDBM50173279(CHEMBL383561 | methyl [1'-(cyclopropylmethyl)-2-ox...)
Affinity DataIC50:  3.60E+3nM. Assay description: Binding affinity determined by the ability to compete with [125I]-Tyr14- nociceptin from binding to human opiate receptor-like 1 expressed in HEK293 ...
In DepthDetails ArticlePubMed