BDBM50173281 CHEMBL198046::methyl 2-[1'-(1,2-dihydro-5-acenaphthylenyl)-2-oxospiro[2,3-dihydro-1H-indole-3,4'-(hexahydropyridine)]-1-yl]acetate
SMILES COC(=O)CN1C(=O)C2(CCN(CC2)c2ccc3CCc4cccc2c34)c2ccccc12
InChI Key InChIKey=WKJSHBYKAXVOOR-UHFFFAOYSA-N
Data  1 IC50
  Tab Delimited (TSV)   2D SDfile   Computed 3D by Vconf -m prep SDfile
Find this compound or compounds like it in BindingDB:
Activity Spreadsheet -- Enzyme Inhibition Constant Data from BindingDB
Found 1 hit for monomerid = 50173281
TargetNociceptin receptor(Homo sapiens (Human))
Johnson & Johnson Pharmaceutical Research And Development
Curated by ChEMBL
LigandPNGBDBM50173281(CHEMBL198046 | methyl 2-[1'-(1,2-dihydro-5-acenaph...)
Affinity DataIC50:  350nM. Assay description: Binding affinity determined by the ability to compete with [125I]-Tyr14- nociceptin from binding to human opiate receptor-like 1 expressed in HEK293 ...
In DepthDetails ArticlePubMed