BDBM50173664 2-(4-Hydroxy-phenyl)-1-phenyl-3H-inden-5-ol::CHEMBL48352
SMILES Oc1ccc(cc1)C1=C(c2ccc(O)cc2C1)c1ccccc1
InChI Key InChIKey=MJQZCFXKRKGVJK-UHFFFAOYSA-N
Data  2 EC50
  Tab Delimited (TSV)   2D SDfile   Computed 3D by Vconf -m prep SDfile
Find this compound or compounds like it in BindingDB:
Activity Spreadsheet -- Enzyme Inhibition Constant Data from BindingDB
Found 2 hits for monomerid = 50173664
TargetEstrogen receptor beta(Homo sapiens (Human))
University Of California
Curated by ChEMBL
LigandPNGBDBM50173664(2-(4-Hydroxy-phenyl)-1-phenyl-3H-inden-5-ol | CHEM...)
Affinity DataEC50:  54nM. Assay description: Transcriptional activation of estrogen receptor beta in U2OS cell using estrogen-regulated luciferase reporter gene plasmid upon incubation for 20-30...
In DepthDetails ArticlePubMed
TargetEstrogen receptor(Homo sapiens (Human))
University Of California
Curated by ChEMBL
LigandPNGBDBM50173664(2-(4-Hydroxy-phenyl)-1-phenyl-3H-inden-5-ol | CHEM...)
Affinity DataEC50:  4.30nM. Assay description: Transcriptional activation of estrogen receptor alpha in U2OS cell using estrogen-regulated luciferase reporter gene plasmid upon incubation for 20-3...
In DepthDetails ArticlePubMed