BDBM501739 4-(2-(Dimethylamino)ethoxy)-2-methyl-6-(pyridin-3-yloxy)-9H-xanthen-9-one::US11028064, Example 53
SMILES CN(C)CCOc1cc(C)cc2c1oc1cc(Oc3cccnc3)ccc1c2=O
InChI Key InChIKey=JVHRIEPTXXUJKJ-UHFFFAOYSA-N
Data  2 IC50
  Tab Delimited (TSV)   2D SDfile   Computed 3D by Vconf -m prep SDfile
Find this compound or compounds like it in BindingDB:
Activity Spreadsheet -- Enzyme Inhibition Constant Data from BindingDB
Found 2 hits for monomerid = 501739
TargetVascular endothelial growth factor receptor 2(Homo sapiens (Human))
Auckland Uniservices
US Patent
LigandPNGBDBM501739(4-(2-(Dimethylamino)ethoxy)-2-methyl-6-(pyridin-3-...)
Affinity DataIC50: >1.00E+4nM. Assay description: IC50 values were determined using the Z′-LYTEŽ activity assay, with ATP concentration used at Km app for the specific assay (500 μM ATP fo...
Ligand InfoPC cidPC sid
In DepthDetails US Patent
TargetMacrophage colony-stimulating factor 1 receptor(Homo sapiens (Human))
Auckland Uniservices
US Patent
LigandPNGBDBM501739(4-(2-(Dimethylamino)ethoxy)-2-methyl-6-(pyridin-3-...)
Affinity DataIC50:  550nM. Assay description: IC50 values were determined using the Z′-LYTEŽ activity assay, with ATP concentration used at Km app for the specific assay (500 μM ATP fo...
Ligand InfoPC cidPC sid
In DepthDetails US Patent