BDBM50174370 3-Chloro-4-[3-(2-chloro-4-fluoro-benzoyl)-ureido]-benzenesulfonamide::CHEMBL198202
SMILES NS(=O)(=O)c1ccc(NC(=O)NC(=O)c2ccc(F)cc2Cl)c(Cl)c1
InChI Key InChIKey=GIUCOCXFAPSPDG-UHFFFAOYSA-N
Data  1 IC50
  Tab Delimited (TSV)   2D SDfile   Computed 3D by Vconf -m prep SDfile
Find this compound or compounds like it in BindingDB:
Activity Spreadsheet -- Enzyme Inhibition Constant Data from BindingDB
Found 1 hit for monomerid = 50174370
TargetGlycogen phosphorylase, liver form(Homo sapiens (Human))
Sanofi-Aventis Deutschland
Curated by ChEMBL
LigandPNGBDBM50174370(3-Chloro-4-[3-(2-chloro-4-fluoro-benzoyl)-ureido]-...)
Affinity DataIC50:  1.55E+3nMpH: 7.2Assay Description:Inhibitory concentration against human liver glycogen phosphorylase enzyme by the addition of glucose-1-phosphate upon incubating for 40 min at 25 de...
In DepthDetails ArticlePubMed