BDBM50177104 3-beta-(4'-methylphenyl)-2-beta-(3,4-dimethoxyphenyl)tropane::CHEMBL388605
SMILES COc1ccc(cc1OC)[C@@H]1C2CCC(C[C@@H]1c1ccc(C)cc1)N2C
InChI Key InChIKey=UBUINJQFQXKDNL-JHDZUBBNSA-N
Data  2 KI  3 IC50
  Tab Delimited (TSV)   2D SDfile   Computed 3D by Vconf -m prep SDfile
Find this compound or compounds like it in BindingDB:
Activity Spreadsheet -- Enzyme Inhibition Constant Data from BindingDB
Found 5 hits for monomerid = 50177104
TargetSodium-dependent serotonin transporter(Homo sapiens (Human))
Research Triangle Institute
Curated by ChEMBL
LigandPNGBDBM50177104(3-beta-(4'-methylphenyl)-2-beta-(3,4-dimethoxyphen...)
Affinity DataKi:  1.25E+3nM. Assay description: Displacement of [3H]paroxetine from 5HTT
In DepthDetails ArticlePubMed
TargetSodium-dependent noradrenaline transporter(Homo sapiens (Human))
Research Triangle Institute
Curated by ChEMBL
LigandPNGBDBM50177104(3-beta-(4'-methylphenyl)-2-beta-(3,4-dimethoxyphen...)
Affinity DataKi:  6.00E+3nM. Assay description: Displacement of [3H]nisoxetine from NET
In DepthDetails ArticlePubMed
TargetSodium-dependent dopamine transporter(Homo sapiens (Human))
Research Triangle Institute
Curated by ChEMBL
LigandPNGBDBM50177104(3-beta-(4'-methylphenyl)-2-beta-(3,4-dimethoxyphen...)
Affinity DataIC50:  23.3nM. Assay description: Displacement of [3H]WIN-35428 from DAT
In DepthDetails ArticlePubMed
TargetSodium-dependent noradrenaline transporter(Homo sapiens (Human))
Research Triangle Institute
Curated by ChEMBL
LigandPNGBDBM50177104(3-beta-(4'-methylphenyl)-2-beta-(3,4-dimethoxyphen...)
Affinity DataIC50:  1.00E+4nM. Assay description: Displacement of [3H]nisoxetine from NET
In DepthDetails ArticlePubMed
TargetSodium-dependent serotonin transporter(Homo sapiens (Human))
Research Triangle Institute
Curated by ChEMBL
LigandPNGBDBM50177104(3-beta-(4'-methylphenyl)-2-beta-(3,4-dimethoxyphen...)
Affinity DataIC50:  1.37E+4nM. Assay description: Displacement of [3H]paroxetine from 5HTT
In DepthDetails ArticlePubMed