BDBM50177514 CHEMBL204451::tert-butyl N-[(1E,2S)-1-{[N-(propan-2-yl)-(C-sulfanylcarbonimidoyl)amino]imino}hexan-2-yl]carbamate
SMILES CCCC[C@H](NC(=O)OC(C)(C)C)C=NNC(=S)NC(C)C
InChI Key InChIKey=DJVXSGSEUWUOCI-LBPRGKRZSA-N
Data  1 IC50
  Tab Delimited (TSV)   2D SDfile   Computed 3D by Vconf -m prep SDfile
Find this compound or compounds like it in BindingDB:
Activity Spreadsheet -- Enzyme Inhibition Constant Data from BindingDB
Found 1 hit for monomerid = 50177514
TargetCathepsin K(Homo sapiens (Human))
Glaxosmithkline
Curated by ChEMBL
LigandPNGBDBM50177514(CHEMBL204451 | tert-butyl N-[(1E,2S)-1-{[N-(propan...)
Affinity DataIC50:  170nM. Assay description: Inhibition of recombinant human cathepsin K in a fluorescence assay
In DepthDetails ArticlePubMed