BDBM50178122 CHEMBL382068::methyl 4-(2-(morpholin-4-yl)-4-oxo-4H-chromen-7-yloxymethyl)-benzoate
SMILES COC(=O)c1ccc(COc2ccc3c(c2)oc(cc3=O)N2CCOCC2)cc1
InChI Key InChIKey=TUURETRBVAYEEX-UHFFFAOYSA-N
Data  1 IC50
  Tab Delimited (TSV)   2D SDfile   Computed 3D by Vconf -m prep SDfile
Find this compound or compounds like it in BindingDB:
Activity Spreadsheet -- Enzyme Inhibition Constant Data from BindingDB
Found 1 hit for monomerid = 50178122
TargetDNA-dependent protein kinase catalytic subunit(Homo sapiens (Human))
School Of Natural Sciences--Chemistry
Curated by ChEMBL
LigandPNGBDBM50178122(CHEMBL382068 | methyl 4-(2-(morpholin-4-yl)-4-oxo-...)
Affinity DataIC50:  3.94E+3nM. Assay description: Inhibitory activity against DNA-dependent protein kinase receptor
In DepthDetails ArticlePubMed