BDBM50179302 2-(5-chloro-1H-benzo[d]imidazol-2-yl)quinoxaline::CHEMBL198673
SMILES Clc1ccc2nc([nH]c2c1)-c1cnc2ccccc2n1
InChI Key InChIKey=SOUPHJBGFDZRAD-UHFFFAOYSA-N
Data  3 KI
  Tab Delimited (TSV)   2D SDfile   Computed 3D by Vconf -m prep SDfile
Find this compound or compounds like it in BindingDB:
Activity Spreadsheet -- Enzyme Inhibition Constant Data from BindingDB
Found 3 hits for monomerid = 50179302
TargetAdenosine receptor A3(Homo sapiens (Human))
Universit£
Curated by ChEMBL
LigandPNGBDBM50179302(2-(5-chloro-1H-benzo[d]imidazol-2-yl)quinoxaline |...)
Affinity DataKi:  632nM. Assay description: Displacement of [125I]AB-MECA from human adenosine A3 receptor expressed in CHO cells
In DepthDetails ArticlePubMed
TargetAdenosine receptor A1(Homo sapiens (Human))
Universit£
Curated by ChEMBL
LigandPNGBDBM50179302(2-(5-chloro-1H-benzo[d]imidazol-2-yl)quinoxaline |...)
Affinity DataKi: >1.00E+4nM. Assay description: Displacement of [3H]DPCPX from human adenosine A1 receptor expressed in CHO cells
In DepthDetails ArticlePubMed
TargetAdenosine receptor A2a(Homo sapiens (Human))
Universit£
Curated by ChEMBL
LigandPNGBDBM50179302(2-(5-chloro-1H-benzo[d]imidazol-2-yl)quinoxaline |...)
Affinity DataKi: >1.00E+4nM. Assay description: Displacement of [3H]NECA from human adenosine A2A receptor expressed in CHO cells
In DepthDetails ArticlePubMed