BDBM50180899 CHEMBL201138::{4-[4-(4-bromophenoxy)benzoyl]phenyl}acetic acid
SMILES OC(=O)Cc1ccc(cc1)C(=O)c1ccc(Oc2ccc(Br)cc2)cc1
InChI Key InChIKey=XVHMPUZJYISELN-UHFFFAOYSA-N
Data  1 IC50
  Tab Delimited (TSV)   2D SDfile   Computed 3D by Vconf -m prep SDfile
Find this compound or compounds like it in BindingDB:
Activity Spreadsheet -- Enzyme Inhibition Constant Data from BindingDB
Found 1 hit for monomerid = 50180899
Target3-oxo-5-alpha-steroid 4-dehydrogenase 2(Homo sapiens (Human))
Saarland University
Curated by ChEMBL
LigandPNGBDBM50180899(CHEMBL201138 | {4-[4-(4-bromophenoxy)benzoyl]pheny...)
Affinity DataIC50:  5nM. Assay description: Displacement of [3H]-[1beta,2beta]-testosterone from 5alpha reductase2 in human prostrate homogenate
In DepthDetails ArticlePubMed