BDBM50181250 CHEMBL203737::ethyl 2-(5-methyl-3-(3-(1-methyl-1H-imidazol-5-yl)propyl)-5-(naphthalen-1-yl)-2,4-dioxoimidazolidin-1-yl)acetate
SMILES CCOC(=O)CN1C(=O)N(CCCc2cncn2C)C(=O)C1(C)c1cccc2ccccc12
InChI Key InChIKey=DVKDXGDRDHMPRP-UHFFFAOYSA-N
Data  1 IC50
  Tab Delimited (TSV)   2D SDfile   Computed 3D by Vconf -m prep SDfile
Find this compound or compounds like it in BindingDB:
Activity Spreadsheet -- Enzyme Inhibition Constant Data from BindingDB
Found 1 hit for monomerid = 50181250
TargetDimer of Protein farnesyltransferase subunit beta(Homo sapiens (Human))
Keimyung University
Curated by ChEMBL
LigandPNGBDBM50181250(CHEMBL203737 | ethyl 2-(5-methyl-3-(3-(1-methyl-1H...)
Affinity DataIC50:  2.80nM. Assay description: Inhibition of farnesyl transferase
In DepthDetails ArticlePubMed