BDBM50181713 5-(3,4-dichlorobenzylidene)-3-(butylsulfonylamino)-4-oxo-2-thionothiazolidine::CHEMBL202934
SMILES CCCCS(=O)(=O)NN1C(=S)SC(=Cc2ccc(Cl)c(Cl)c2)C1=O
InChI Key InChIKey=RSVHLESONZNEEH-UHFFFAOYSA-N
Data  1 IC50
  Tab Delimited (TSV)   2D SDfile   Computed 3D by Vconf -m prep SDfile
Find this compound or compounds like it in BindingDB:
Activity Spreadsheet -- Enzyme Inhibition Constant Data from BindingDB
Found 1 hit for monomerid = 50181713
TargetRNA-directed RNA polymerase(Hepatitis C virus)
Amgen
Curated by ChEMBL
LigandPNGBDBM50181713(5-(3,4-dichlorobenzylidene)-3-(butylsulfonylamino)...)
Affinity DataIC50:  700nM. Assay description: Inhibitory activity against HCV delta 21 NS5b RNA polymerase
In DepthDetails ArticlePubMed