BDBM50181860 4-methyl-6,7,8,9-tetrahydrobenzofuro[3,2-g]chromen-2-one::CHEMBL202112
SMILES Cc1cc(=O)oc2cc3oc4CCCCc4c3cc12
InChI Key InChIKey=GSCQGWISTGMGFM-UHFFFAOYSA-N
Data  1 IC50
  Tab Delimited (TSV)   2D SDfile   Computed 3D by Vconf -m prep SDfile
Find this compound or compounds like it in BindingDB:
Activity Spreadsheet -- Enzyme Inhibition Constant Data from BindingDB
Found 1 hit for monomerid = 50181860
TargetAmine oxidase [flavin-containing] A(Homo sapiens (Human))
University Of Santiago De Compostela
Curated by ChEMBL
LigandPNGBDBM50181860(4-methyl-6,7,8,9-tetrahydrobenzofuro[3,2-g]chromen...)
Affinity DataIC50:  6.53E+4nM. Assay description: Inhibition of MAO-A activity
In DepthDetails ArticlePubMed