BDBM50183467 4-benzoyl-5-(2,4-dimethoxyphenyl)-3-hydroxy-1H-pyrrol-2(5H)-one::CHEMBL381095
SMILES CCN(CC)CCN1C(C(C(=O)c2ccccc2)C(=O)C1=O)c1ccc(OC)cc1OC
InChI Key InChIKey=FXISTMYSHLWZMB-UHFFFAOYSA-N
Data  2 IC50
  Tab Delimited (TSV)   2D SDfile   Computed 3D by Vconf -m prep SDfile
Find this compound or compounds like it in BindingDB:
Activity Spreadsheet -- Enzyme Inhibition Constant Data from BindingDB
Found 2 hits for monomerid = 50183467
TargetIntegrase(Human immunodeficiency virus 1)
University Of Houston
Curated by ChEMBL
LigandPNGBDBM50183467(4-benzoyl-5-(2,4-dimethoxyphenyl)-3-hydroxy-1H-pyr...)
Affinity DataIC50: >1.00E+6nM. Assay description: Inhibition of 3'-processing activity of HIV1 integrase
In DepthDetails ArticlePubMed
TargetIntegrase(Human immunodeficiency virus 1)
University Of Houston
Curated by ChEMBL
LigandPNGBDBM50183467(4-benzoyl-5-(2,4-dimethoxyphenyl)-3-hydroxy-1H-pyr...)
Affinity DataIC50: >1.00E+6nM. Assay description: Inhibition of strand transfer activity of HIV1 integrase
In DepthDetails ArticlePubMed