BDBM50183976 CHEMBL207232::methyl 2-(2-(3-(2-(3,4,5-trimethoxyphenylamino)-7H-pyrrolo[2,3-d]pyrimidin-7-yl)phenyl)acetamido)acetate
SMILES COC(=O)CNC(=O)Cc1cccc(c1)-n1ccc2cnc(Nc3cc(OC)c(OC)c(OC)c3)nc12
InChI Key InChIKey=NSXBBJOTAIVZJR-UHFFFAOYSA-N
Data  1 IC50
  Tab Delimited (TSV)   2D SDfile   Computed 3D by Vconf -m prep SDfile
Find this compound or compounds like it in BindingDB:
Activity Spreadsheet -- Enzyme Inhibition Constant Data from BindingDB
Found 1 hit for monomerid = 50183976
TargetFocal adhesion kinase 1(Homo sapiens (Human))
Genomics Institute Of The Novartis Research Foundation
Curated by ChEMBL
LigandPNGBDBM50183976(CHEMBL207232 | methyl 2-(2-(3-(2-(3,4,5-trimethoxy...)
Affinity DataIC50:  635nM. Assay description: Inhibition of FAK
In DepthDetails ArticlePubMed