BDBM50184395 5-hexanoyloxymethyl-5-hydroxymethyl-3-[(Z)-3-isobutyl-5-methylhexylidene]tetrahydro-2-furanone::CHEMBL383615
SMILES CCCCCC(=O)OCC1(CO)C\C(=C\CC(CC(C)C)CC(C)C)C(=O)O1
InChI Key InChIKey=OZIFHSVKNRRXGM-JAIQZWGSSA-N
Data  1 KI
  Tab Delimited (TSV)   2D SDfile   Computed 3D by Vconf -m prep SDfile
Find this compound or compounds like it in BindingDB:
Activity Spreadsheet -- Enzyme Inhibition Constant Data from BindingDB
Found 1 hit for monomerid = 50184395
TargetProtein kinase C alpha type(Homo sapiens (Human))
Research Institute Of Pharmaceutical Sciences
Curated by ChEMBL
LigandPNGBDBM50184395(5-hexanoyloxymethyl-5-hydroxymethyl-3-[(Z)-3-isobu...)
Affinity DataKi:  3.80nM. Assay description: Displacement of [20-3H]PDBu from recombinant PKC alpha in presence of phosphatidylserine
In DepthDetails ArticlePubMed