BDBM50184556 4-(2-(2-(2,2-diphenylethyl)-3,5-dioxo-1,2,4-oxadiazolidin-4-yl)ethoxy)-2-hydroxybenzoic acid::CHEMBL379418
SMILES OC(=O)c1ccc(OCCn2c(=O)on(CC(c3ccccc3)c3ccccc3)c2=O)cc1O
InChI Key InChIKey=BIVZMQVLMQKFGX-UHFFFAOYSA-N
Data  1 IC50
  Tab Delimited (TSV)   2D SDfile   Computed 3D by Vconf -m prep SDfile
Find this compound or compounds like it in BindingDB:
Activity Spreadsheet -- Enzyme Inhibition Constant Data from BindingDB
Found 1 hit for monomerid = 50184556
TargetCytosolic phospholipase A2(Homo sapiens (Human))
Wyeth Research
Curated by ChEMBL
LigandPNGBDBM50184556(4-(2-(2-(2,2-diphenylethyl)-3,5-dioxo-1,2,4-oxadia...)
Affinity DataIC50:  2.70E+4nM. Assay description: Inhibition of cPLA2-alpha by GLU micelle assay
In DepthDetails ArticlePubMed