BDBM50184860 CHEMBL380703::Phenyl N-{4-[(6,7-Dimethoxy-4-quinolyl)oxy]phenyl}carbamate
SMILES COc1cc2nccc(Oc3ccc(NC(=O)Oc4ccccc4)cc3)c2cc1OC
InChI Key InChIKey=KVDZJYLUBBYJIX-UHFFFAOYSA-N
Data  2 IC50
  Tab Delimited (TSV)   2D SDfile   Computed 3D by Vconf -m prep SDfile
Find this compound or compounds like it in BindingDB:
Activity Spreadsheet -- Enzyme Inhibition Constant Data from BindingDB
Found 2 hits for monomerid = 50184860
TargetPlatelet-derived growth factor receptor alpha(Homo sapiens (Human))
Kirin Brewery
Curated by ChEMBL
LigandPNGBDBM50184860(CHEMBL380703 | Phenyl N-{4-[(6,7-Dimethoxy-4-quino...)
Affinity DataIC50:  5nM. Assay description: Inhibition of PDGFR alpha phosphorylation in G292 cell
In DepthDetails ArticlePubMed
TargetMast/stem cell growth factor receptor Kit(Homo sapiens (Human))
Kirin Brewery
Curated by ChEMBL
LigandPNGBDBM50184860(CHEMBL380703 | Phenyl N-{4-[(6,7-Dimethoxy-4-quino...)
Affinity DataIC50:  19nM. Assay description: Inhibition of c-kit receptor phosphorylation in M07e cell
In DepthDetails ArticlePubMed