BDBM50185380 (S)-(2-(pyrrolidin-1-ylmethyl)pyrrolidin-1-yl)(6-(trifluoromethyl)benzofuran-2-yl)methanone::CHEMBL208003
SMILES FC(F)(F)c1ccc2cc(oc2c1)C(=O)N1CCC[C@H]1CN1CCCC1
InChI Key InChIKey=FEWXSMUQIMFEBX-HNNXBMFYSA-N
Data  1 KI
  Tab Delimited (TSV)   2D SDfile   Computed 3D by Vconf -m prep SDfile
Find this compound or compounds like it in BindingDB:
Activity Spreadsheet -- Enzyme Inhibition Constant Data from BindingDB
Found 1 hit for monomerid = 50185380
TargetHistamine H3 receptor(Homo sapiens (Human))
Novo Nordisk
Curated by ChEMBL
LigandPNGBDBM50185380((S)-(2-(pyrrolidin-1-ylmethyl)pyrrolidin-1-yl)(6-(...)
Affinity DataKi:  15nM. Assay description: Antagonist activity at human histamine H3 receptor by [35S]GTPgammaS assay
In DepthDetails ArticlePubMed