BDBM50185381 (S)-(3-chlorobenzo[b]thiophen-2-yl)(2-(pyrrolidin-1-ylmethyl)pyrrolidin-1-yl)methanone::CHEMBL376957
SMILES Clc1c(sc2ccccc12)C(=O)N1CCC[C@H]1CN1CCCC1
InChI Key InChIKey=VMKCHYACDWQJDE-ZDUSSCGKSA-N
Data  1 KI
  Tab Delimited (TSV)   2D SDfile   Computed 3D by Vconf -m prep SDfile
Find this compound or compounds like it in BindingDB:
Activity Spreadsheet -- Enzyme Inhibition Constant Data from BindingDB
Found 1 hit for monomerid = 50185381
TargetHistamine H3 receptor(Homo sapiens (Human))
Novo Nordisk
Curated by ChEMBL
LigandPNGBDBM50185381((S)-(3-chlorobenzo[b]thiophen-2-yl)(2-(pyrrolidin-...)
Affinity DataKi:  12nM. Assay description: Antagonist activity at human histamine H3 receptor by [35S]GTPgammaS assay
In DepthDetails ArticlePubMed