BDBM50186432 4-tert-butylphenyl 2-(3-(4-hydroxyphenyl)-4,5-dihydroisoxazol-5-yl)acetate::CHEMBL211823::US8618147, 4
SMILES CC(C)(C)c1ccc(OC(=O)CC2CC(=NO2)c2ccc(O)cc2)cc1
InChI Key InChIKey=WOLOAMSCBJWWCF-UHFFFAOYSA-N
Data  2 IC50
  Tab Delimited (TSV)   2D SDfile   Computed 3D by Vconf -m prep SDfile
Find this compound or compounds like it in BindingDB:
Activity Spreadsheet -- Enzyme Inhibition Constant Data from BindingDB
Found 2 hits for monomerid = 50186432
TargetMacrophage migration inhibitory factor(Homo sapiens (Human))
Institute For Medical Research
Curated by ChEMBL
LigandPNGBDBM50186432(4-tert-butylphenyl 2-(3-(4-hydroxyphenyl)-4,5-dihy...)
Affinity DataIC50:  1.00E+4nM. Assay description: Inhibition of MIF tautomerase activity
In DepthDetails ArticlePubMed
TargetMacrophage migration inhibitory factor(Mus musculus (Mouse))
The Feinstein Institute For Medical Research
US Patent
LigandPNGBDBM50186432(4-tert-butylphenyl 2-(3-(4-hydroxyphenyl)-4,5-dihy...)
Affinity DataIC50:  1.00E+4nMpH: 7.2 T: 2°C. Assay description: MIF tautomerase activity was measured by UV-Visible recording spectrophotometry (SHIMADZU, UV1600U). A fresh stock solution of L-dopachrome methyl es...
In DepthDetails US Patent