BDBM50191563 (S)-2-acetamido-N-((R)-1-((2S,4R)-2-(3-guanidinopropyl)-4-(naphthalen-2-ylmethoxy)pyrrolidin-1-yl)-1-oxo-3-phenylpropan-2-yl)-3-(4-hydroxyphenyl)propanamide::CHEMBL377620
SMILES [#6]-[#6](=O)-[#7]-[#6@@H](-[#6]-c1ccc(-[#8])cc1)-[#6](=O)-[#7]-[#6@H](-[#6]-c1ccccc1)-[#6](=O)-[#7]-1-[#6]-[#6@@H](-[#6]-[#6@@H]-1-[#6]-[#6]-[#6]\[#7]=[#6](\[#7])-[#7])-[#8]-[#6]-c1ccc2ccccc2c1
InChI Key InChIKey=OJPUSZQXDWHXOL-GIFUDOJISA-N
Data  3 KI  3 EC50
  Tab Delimited (TSV)   2D SDfile   Computed 3D by Vconf -m prep SDfile
Find this compound or compounds like it in BindingDB:
Activity Spreadsheet -- Enzyme Inhibition Constant Data from BindingDB
Found 6 hits for monomerid = 50191563
TargetMelanocortin receptor 4(Homo sapiens (Human))
Procter & Gamble Pharmaceuticals
Curated by ChEMBL
LigandPNGBDBM50191563((S)-2-acetamido-N-((R)-1-((2S,4R)-2-(3-guanidinopr...)
Affinity DataKi:  21nM. Assay description: Displacement of europium labeled NDP-alpha-MSH from human MC4R expressed in HEK293 cells
In DepthDetails ArticlePubMed
TargetMelanocortin receptor 3(Homo sapiens (Human))
Procter & Gamble Pharmaceuticals
Curated by ChEMBL
LigandPNGBDBM50191563((S)-2-acetamido-N-((R)-1-((2S,4R)-2-(3-guanidinopr...)
Affinity DataKi:  42nM. Assay description: Displacement of europium labeled NDP-alpha-MSH from human MC3R expressed in HEK293 cells
In DepthDetails ArticlePubMed
TargetMelanocyte-stimulating hormone receptor(Homo sapiens (Human))
Procter & Gamble Pharmaceuticals
Curated by ChEMBL
LigandPNGBDBM50191563((S)-2-acetamido-N-((R)-1-((2S,4R)-2-(3-guanidinopr...)
Affinity DataKi:  85nM. Assay description: Displacement of europium labeled NDP-alpha-MSH from human MC1R expressed in HEK293 cells
In DepthDetails ArticlePubMed
TargetMelanocortin receptor 4(Homo sapiens (Human))
Procter & Gamble Pharmaceuticals
Curated by ChEMBL
LigandPNGBDBM50191563((S)-2-acetamido-N-((R)-1-((2S,4R)-2-(3-guanidinopr...)
Affinity DataEC50:  14nM. Assay description: Agonist activity at human MC4R transfected in HEK293 cells
In DepthDetails ArticlePubMed
TargetMelanocortin receptor 3(Homo sapiens (Human))
Procter & Gamble Pharmaceuticals
Curated by ChEMBL
LigandPNGBDBM50191563((S)-2-acetamido-N-((R)-1-((2S,4R)-2-(3-guanidinopr...)
Affinity DataEC50:  85nM. Assay description: Agonist activity at human MC3R transfected in HEK293 cells
In DepthDetails ArticlePubMed
TargetMelanocyte-stimulating hormone receptor(Homo sapiens (Human))
Procter & Gamble Pharmaceuticals
Curated by ChEMBL
LigandPNGBDBM50191563((S)-2-acetamido-N-((R)-1-((2S,4R)-2-(3-guanidinopr...)
Affinity DataEC50:  88nM. Assay description: Agonist activity at human MC1R transfected in HEK293 cells
In DepthDetails ArticlePubMed