BDBM50191684 CHEMBL213433::flavaspidic acid-PB
SMILES CCCC(=O)c1c(O)c(C)c(O)c(CC2C(=O)C(C(=O)CC)C(=O)C(C)(C)C2=O)c1O
InChI Key InChIKey=YEVLHTFPUACDLE-UHFFFAOYSA-N
Data  1 IC50
  Tab Delimited (TSV)   2D SDfile   Computed 3D by Vconf -m prep SDfile
Find this compound or compounds like it in BindingDB:
Activity Spreadsheet -- Enzyme Inhibition Constant Data from BindingDB
Found 1 hit for monomerid = 50191684
TargetFatty acid synthase(Homo sapiens (Human))
Korea Research Institute Of Bioscience And Biotechnology
Curated by ChEMBL
LigandPNGBDBM50191684(CHEMBL213433 | flavaspidic acid-PB)
Affinity DataIC50:  2.31E+4nM. Assay description: Inhibition of FAS
In DepthDetails ArticlePubMed